{"text_format":"1","workbook":"xlsx","n_sheets":5,"sheets":["U_Calculation","DB","Instrucciones","Instructions","Traduc"],"not_rendered":{"charts":0,"images":13,"macros":1,"external_links":0,"defined_names":2,"comments":0,"pivot_tables":0},"unopened":[],"bounds":{"document_bytes":16777216,"sheet_cells":100000,"rows_first":2000,"rows_last":500,"rows_between":2000,"halvings":0,"cell_chars":16384,"cell_head_chars":4096},"cells_cut":0,"cells_raw":0,"read":"whole","date_system":"1900"}

{"sheet":"U_Calculation","index":0,"n_rows":77,"n_cols":428,"rows_kept":77,"cut":false,"hidden":false,"merged":[[15,7,15,9],[15,11,15,13],[10,1,10,3],[11,1,11,3],[15,3,15,5]]}
[null,null,null,{"$f":"Traduc!B3","v":"Thermal Transmittance calculation opaque walls"}]
[null,null,null,"EN ISO 6946",null,null,null,null,null,null,null,null,null,null,null,null,null,null,null,null,null,null,null,null,null,null,null,null,null,1]
[]
[]
[]
[]
[]
[]
[null,null,null,null,null,null,null,null,null,null,null,null,null,null,null,null,null,null,null,null,null,null,null,null,null,null,null,null,null,null,null,null,null,null,null,null,null,null,null,null,null,null,null,null,null,null,null,null,null,null,null,null,null,null,null,null,null,null,null,null,null,null,null,null,null,null,null,null,null,null,null,null,null,null,null,null,null,null,null,null,null,null,null,null,null,null,null,null,null,null,null,null,null,null,null,null,null,null,null,null,null,null,null,null,null,null,null,null,null,null,null,null,null,null,null,null,null,null,null,null,null,null,null,null,null,null,null,null,null,null,null,null,null,null,null,null,null,null,null,null,null,null,null,null,null,null,null,null,null,null,null,null,null,null,null,null,null,null,null,null,null,null,null,null,null,null,null,null,null,null,null,null,null,null,null,null,null,null,null,null,null,null,null,null,null,null,null,null,null,null,null,null,null,null,null,null,null,null,null,null,null,null,null,null,null,null,null,null,null,null,null,null,null,null,null,null,null,null,null,null,null,null,null,null,null,null,null,null,null,null,null,null,null,null,null,null,null,null,null,null,null,null,null,null,null,null,null,null,null,null,null,null,null,null,null,null,null,null,null,null,null,null,null,null,null,null,null,null,null,null,null,null,null,null,null,null,null,null,null,null,null,null,null,null,null,null,null,null,null,null,null,null,null,null,null,null,null,null,null,null,null,null,null,null,null,null,null,null,null,null,null,null,null,null,null,null,null,null,null,null,null,null,null,null,null,null,null,null,null,null,null,null,null,null,null,null,null,null,null,null,null,null,null,null,null,null,null,null,null,null,null,null,null,null,null,null,null,null,null,null,null,null,null,null,null,null,null,null,null,null,null,null,null,null,null,null,null,null,null,null,null,null,null,null,null,null,null,null,null,null,null,null,null,null,null,null,null,null,null,null,null,null,null,null,null,null,null,null,null,null,null,null,null,null,null,null,null,null,null,null,null,null,null,null,null,null,null,224]
[]
[]
[]
[null,{"$f":"Traduc!B4","v":"Construction shall be divided in layers (perpendicular to heat flow) and Sections (parallel to heat flow)"}]
[null,null,{"$f":"Traduc!B5","v":"Type of wall"},1,"Rsi+Rse (m2·K/W)",{"$f":"INDEX(DB!B335:E340,D14,4)","v":0.17}]
[null,null,null,null,{"$f":"Traduc!B6","v":"Total Length (m)"},{"$f":"X18+T18+P18+L18+H18+D18","v":0.6}]
[null,null,null,{"$f":"Traduc!B7","v":"Section a"},null,null,null,{"$f":"Traduc!B8","v":"Section b"},null,null,null,{"$f":"Traduc!B9","v":"Section c"},null,null,null,{"$f":"Traduc!B10","v":"Section d"},null,null,null,{"$f":"Traduc!B11","v":"Section f"},null,null,null,{"$f":"Traduc!B12","v":"Section g"}]
[null,null,null,{"$f":"Traduc!B13","v":"Length (m)"},null,null,null,{"$f":"Traduc!B13","v":"Length (m)"},null,null,null,{"$f":"Traduc!B13","v":"Length (m)"},null,null,null,{"$f":"Traduc!B13","v":"Length (m)"},null,null,null,{"$f":"Traduc!B13","v":"Length (m)"},null,null,null,{"$f":"Traduc!B13","v":"Length (m)"}]
[null,null,null,0.5,null,null,null,0.05,null,null,null,0.05,null,null,null,0,null,null,null,0,null,null,null,0]
[null,null,null,"fa",null,null,null,"fa",null,null,null,"fa",null,null,null,"fa",null,null,null,"fa",null,null,null,"fa"]
[null,null,"fa",{"$f":"D18/$F$15","v":0.83333333333333337},null,null,null,{"$f":"H18/$F$15","v":8.3333333333333343E-2},null,null,null,{"$f":"L18/$F$15","v":8.3333333333333343E-2},null,null,null,{"$f":"P18/$F$15","v":0},null,null,null,{"$f":"T18/$F$15","v":0},null,null,null,{"$f":"X18/$F$15","v":0},null,null,null,{"$f":"X20+T20+P20+L20+H20+D20","v":1}]
[null,{"$f":"Traduc!B14","v":"Layers"},{"$f":"Traduc!B15","v":"Thickness (m)"},{"$f":"Traduc!B16","v":"Product"},"l (W/mK)","Ri (m2·K/W)","fa/Ra",{"$f":"Traduc!B16","v":"Product"},"l (W/mK)","Ri (m2·K/W)","fa/Ra",{"$f":"Traduc!B16","v":"Product"},"l (W/mK)","Ri (m2·K/W)","fa/Ra",{"$f":"Traduc!B16","v":"Product"},"l (W/mK)","Ri (m2·K/W)","fa/Ra",{"$f":"Traduc!B16","v":"Product"},"l (W/mK)","Ri (m2·K/W)","fa/Ra",{"$f":"Traduc!B16","v":"Product"},"l (W/mK)","Ri (m2·K/W)","fa/Ra","1 / S(fa/Raj)"]
[null,1,0.13,154,{"$f":"INDEX(DB!$A$3:$D$319,D22,3)","v":0},{"$f":"IF(E22=0,INDEX(DB!$B$3:$D$318,D22,3),$C22/E22)","v":0.17280000000000012},{"$f":"IF(F22=0,0,D$20/F22)","v":4.8225308641975273},154,{"$f":"INDEX(DB!$A$3:$D$319,H22,3)","v":0},{"$f":"IF(I22=0,INDEX(DB!$B$3:$D$318,H22,3),$C22/I22)","v":0.17280000000000012},{"$f":"IF(J22=0,0,H$20/J22)","v":0.48225308641975279},154,{"$f":"INDEX(DB!$A$3:$D$319,L22,3)","v":0},{"$f":"IF(M22=0,INDEX(DB!$B$3:$D$318,L22,3),$C22/M22)","v":0.17280000000000012},{"$f":"IF(N22=0,0,L$20/N22)","v":0.48225308641975279},1,{"$f":"INDEX(DB!$A$3:$D$319,P22,3)","v":0},{"$f":"IF(Q22=0,INDEX(DB!$B$3:$D$318,P22,3),$C22/Q22)","v":0},{"$f":"IF(R22=0,0,P$20/R22)","v":0},1,{"$f":"INDEX(DB!$A$3:$D$319,T22,3)","v":0},{"$f":"IF(U22=0,INDEX(DB!$B$3:$D$318,T22,3),$C22/U22)","v":0},{"$f":"IF(V22=0,0,T$20/V22)","v":0},1,{"$f":"INDEX(DB!$A$3:$D$319,X22,3)","v":0},{"$f":"IF(Y22=0,INDEX(DB!$B$3:$D$318,X22,3),$C22/Y22)","v":0},{"$f":"IF(Z22=0,0,X$20/Z22)","v":0},{"$f":"IF((AA22+W22+S22+O22+K22+G22)=0,0,1/(AA22+W22+S22+O22+K22+G22))","v":0.17280000000000012}]
[null,2,0.01,187,{"$f":"INDEX(DB!$A$3:$D$319,D23,3)","v":0.8},{"$f":"IF(E23=0,INDEX(DB!$B$3:$D$318,D23,3),$C23/E23)","v":1.2499999999999999E-2},66.666666666666671,187,{"$f":"INDEX(DB!$A$3:$D$319,H23,3)","v":0.8},{"$f":"IF(I23=0,INDEX(DB!$B$3:$D$318,H23,3),$C23/I23)","v":1.2499999999999999E-2},6.6666666666666679,187,{"$f":"INDEX(DB!$A$3:$D$319,L23,3)","v":0.8},{"$f":"IF(M23=0,INDEX(DB!$B$3:$D$318,L23,3),$C23/M23)","v":1.2499999999999999E-2},6.6666666666666679,1,{"$f":"INDEX(DB!$A$3:$D$319,P23,3)","v":0},{"$f":"IF(Q23=0,INDEX(DB!$B$3:$D$318,P23,3),$C23/Q23)","v":0},0,1,{"$f":"INDEX(DB!$A$3:$D$319,T23,3)","v":0},{"$f":"IF(U23=0,INDEX(DB!$B$3:$D$318,T23,3),$C23/U23)","v":0},0,1,{"$f":"INDEX(DB!$A$3:$D$319,X23,3)","v":0},{"$f":"IF(Y23=0,INDEX(DB!$B$3:$D$318,X23,3),$C23/Y23)","v":0},0,1.2500000000000001E-2]
[null,3,0.06,256,{"$f":"INDEX(DB!$A$3:$D$319,D24,3)","v":3.5000000000000003E-2},{"$f":"IF(E24=0,INDEX(DB!$B$3:$D$318,D24,3),$C24/E24)","v":1.714285714285714},0.48611111111111122,274,{"$f":"INDEX(DB!$A$3:$D$319,H24,3)","v":0.15},{"$f":"IF(I24=0,INDEX(DB!$B$3:$D$318,H24,3),$C24/I24)","v":0.4},0.20833333333333334,256,{"$f":"INDEX(DB!$A$3:$D$319,L24,3)","v":3.5000000000000003E-2},{"$f":"IF(M24=0,INDEX(DB!$B$3:$D$318,L24,3),$C24/M24)","v":1.714285714285714},4.8611111111111126E-2,1,{"$f":"INDEX(DB!$A$3:$D$319,P24,3)","v":0},{"$f":"IF(Q24=0,INDEX(DB!$B$3:$D$318,P24,3),$C24/Q24)","v":0},0,1,{"$f":"INDEX(DB!$A$3:$D$319,T24,3)","v":0},{"$f":"IF(U24=0,INDEX(DB!$B$3:$D$318,T24,3),$C24/U24)","v":0},0,1,{"$f":"INDEX(DB!$A$3:$D$319,X24,3)","v":0},{"$f":"IF(Y24=0,INDEX(DB!$B$3:$D$318,X24,3),$C24/Y24)","v":0},0,1.3457943925233642]
[null,4,0.05,256,{"$f":"INDEX(DB!$A$3:$D$319,D25,3)","v":3.5000000000000003E-2},{"$f":"IF(E25=0,INDEX(DB!$B$3:$D$318,D25,3),$C25/E25)","v":1.4285714285714286},0.58333333333333337,256,{"$f":"INDEX(DB!$A$3:$D$319,H25,3)","v":3.5000000000000003E-2},{"$f":"IF(I25=0,INDEX(DB!$B$3:$D$318,H25,3),$C25/I25)","v":1.4285714285714286},5.8333333333333341E-2,256,{"$f":"INDEX(DB!$A$3:$D$319,L25,3)","v":3.5000000000000003E-2},{"$f":"IF(M25=0,INDEX(DB!$B$3:$D$318,L25,3),$C25/M25)","v":1.4285714285714286},5.8333333333333341E-2,1,{"$f":"INDEX(DB!$A$3:$D$319,P25,3)","v":0},{"$f":"IF(Q25=0,INDEX(DB!$B$3:$D$318,P25,3),$C25/Q25)","v":0},0,1,{"$f":"INDEX(DB!$A$3:$D$319,T25,3)","v":0},{"$f":"IF(U25=0,INDEX(DB!$B$3:$D$318,T25,3),$C25/U25)","v":0},0,1,{"$f":"INDEX(DB!$A$3:$D$319,X25,3)","v":0},{"$f":"IF(Y25=0,INDEX(DB!$B$3:$D$318,X25,3),$C25/Y25)","v":0},0,1.4285714285714284]
[null,5,0.05,256,{"$f":"INDEX(DB!$A$3:$D$319,D26,3)","v":3.5000000000000003E-2},{"$f":"IF(E26=0,INDEX(DB!$B$3:$D$318,D26,3),$C26/E26)","v":1.4285714285714286},0.58333333333333337,256,{"$f":"INDEX(DB!$A$3:$D$319,H26,3)","v":3.5000000000000003E-2},{"$f":"IF(I26=0,INDEX(DB!$B$3:$D$318,H26,3),$C26/I26)","v":1.4285714285714286},5.8333333333333341E-2,274,{"$f":"INDEX(DB!$A$3:$D$319,L26,3)","v":0.15},{"$f":"IF(M26=0,INDEX(DB!$B$3:$D$318,L26,3),$C26/M26)","v":0.33333333333333337},0.25,1,{"$f":"INDEX(DB!$A$3:$D$319,P26,3)","v":0},{"$f":"IF(Q26=0,INDEX(DB!$B$3:$D$318,P26,3),$C26/Q26)","v":0},0,1,{"$f":"INDEX(DB!$A$3:$D$319,T26,3)","v":0},{"$f":"IF(U26=0,INDEX(DB!$B$3:$D$318,T26,3),$C26/U26)","v":0},0,1,{"$f":"INDEX(DB!$A$3:$D$319,X26,3)","v":0},{"$f":"IF(Y26=0,INDEX(DB!$B$3:$D$318,X26,3),$C26/Y26)","v":0},0,1.1214953271028036]
[null,6,2.5000000000000001E-2,21,{"$f":"INDEX(DB!$A$3:$D$319,D27,3)","v":0},{"$f":"IF(E27=0,INDEX(DB!$B$3:$D$318,D27,3),$C27/E27)","v":0.18},4.6296296296296298,21,{"$f":"INDEX(DB!$A$3:$D$319,H27,3)","v":0},{"$f":"IF(I27=0,INDEX(DB!$B$3:$D$318,H27,3),$C27/I27)","v":0.18},0.46296296296296302,21,{"$f":"INDEX(DB!$A$3:$D$319,L27,3)","v":0},{"$f":"IF(M27=0,INDEX(DB!$B$3:$D$318,L27,3),$C27/M27)","v":0.18},0.46296296296296302,1,{"$f":"INDEX(DB!$A$3:$D$319,P27,3)","v":0},{"$f":"IF(Q27=0,INDEX(DB!$B$3:$D$318,P27,3),$C27/Q27)","v":0},0,1,{"$f":"INDEX(DB!$A$3:$D$319,T27,3)","v":0},{"$f":"IF(U27=0,INDEX(DB!$B$3:$D$318,T27,3),$C27/U27)","v":0},0,1,{"$f":"INDEX(DB!$A$3:$D$319,X27,3)","v":0},{"$f":"IF(Y27=0,INDEX(DB!$B$3:$D$318,X27,3),$C27/Y27)","v":0},0,0.18]
[null,7,0.05,163,{"$f":"INDEX(DB!$A$3:$D$319,D28,3)","v":0},{"$f":"IF(E28=0,INDEX(DB!$B$3:$D$318,D28,3),$C28/E28)","v":0.11250000000000013},7.4074074074073994,163,{"$f":"INDEX(DB!$A$3:$D$319,H28,3)","v":0},{"$f":"IF(I28=0,INDEX(DB!$B$3:$D$318,H28,3),$C28/I28)","v":0.11250000000000013},0.74074074074074003,163,{"$f":"INDEX(DB!$A$3:$D$319,L28,3)","v":0},{"$f":"IF(M28=0,INDEX(DB!$B$3:$D$318,L28,3),$C28/M28)","v":0.11250000000000013},0.74074074074074003,1,{"$f":"INDEX(DB!$A$3:$D$319,P28,3)","v":0},{"$f":"IF(Q28=0,INDEX(DB!$B$3:$D$318,P28,3),$C28/Q28)","v":0},0,1,{"$f":"INDEX(DB!$A$3:$D$319,T28,3)","v":0},{"$f":"IF(U28=0,INDEX(DB!$B$3:$D$318,T28,3),$C28/U28)","v":0},0,1,{"$f":"INDEX(DB!$A$3:$D$319,X28,3)","v":0},{"$f":"IF(Y28=0,INDEX(DB!$B$3:$D$318,X28,3),$C28/Y28)","v":0},0,0.11250000000000013]
[null,8,1.4999999999999999E-2,224,{"$f":"INDEX(DB!$A$3:$D$319,D29,3)","v":0.56999999999999995},{"$f":"IF(E29=0,INDEX(DB!$B$3:$D$318,D29,3),$C29/E29)","v":2.6315789473684213E-2},31.666666666666664,224,{"$f":"INDEX(DB!$A$3:$D$319,H29,3)","v":0.56999999999999995},{"$f":"IF(I29=0,INDEX(DB!$B$3:$D$318,H29,3),$C29/I29)","v":2.6315789473684213E-2},3.166666666666667,224,{"$f":"INDEX(DB!$A$3:$D$319,L29,3)","v":0.56999999999999995},{"$f":"IF(M29=0,INDEX(DB!$B$3:$D$318,L29,3),$C29/M29)","v":2.6315789473684213E-2},3.166666666666667,1,{"$f":"INDEX(DB!$A$3:$D$319,P29,3)","v":0},{"$f":"IF(Q29=0,INDEX(DB!$B$3:$D$318,P29,3),$C29/Q29)","v":0},0,1,{"$f":"INDEX(DB!$A$3:$D$319,T29,3)","v":0},{"$f":"IF(U29=0,INDEX(DB!$B$3:$D$318,T29,3),$C29/U29)","v":0},0,1,{"$f":"INDEX(DB!$A$3:$D$319,X29,3)","v":0},{"$f":"IF(Y29=0,INDEX(DB!$B$3:$D$318,X29,3),$C29/Y29)","v":0},0,2.6315789473684209E-2]
[null,9,null,1,{"$f":"INDEX(DB!$A$3:$D$319,D30,3)","v":0},{"$f":"IF(E30=0,INDEX(DB!$B$3:$D$318,D30,3),$C30/E30)","v":0},0,1,{"$f":"INDEX(DB!$A$3:$D$319,H30,3)","v":0},{"$f":"IF(I30=0,INDEX(DB!$B$3:$D$318,H30,3),$C30/I30)","v":0},0,1,{"$f":"INDEX(DB!$A$3:$D$319,L30,3)","v":0},{"$f":"IF(M30=0,INDEX(DB!$B$3:$D$318,L30,3),$C30/M30)","v":0},0,1,{"$f":"INDEX(DB!$A$3:$D$319,P30,3)","v":0},{"$f":"IF(Q30=0,INDEX(DB!$B$3:$D$318,P30,3),$C30/Q30)","v":0},0,1,{"$f":"INDEX(DB!$A$3:$D$319,T30,3)","v":0},{"$f":"IF(U30=0,INDEX(DB!$B$3:$D$318,T30,3),$C30/U30)","v":0},0,1,{"$f":"INDEX(DB!$A$3:$D$319,X30,3)","v":0},{"$f":"IF(Y30=0,INDEX(DB!$B$3:$D$318,X30,3),$C30/Y30)","v":0},0,0]
{"$rows_left_out":48}
{"sheet":"DB","index":1,"n_rows":350,"n_cols":14,"rows_kept":350,"cut":false,"hidden":false,"merged":[]}
[]
[null,"Material","Lambda (W/m·K)","R (m2.K/W)",null,null,null,null,"id","English","Español","Français","Lambda (W/m·K)","R (m2.K/W)"]
[null,{"$f":"INDEX(J3:L3,U_Calculation!$AD$2)","v":"None"},{"$f":"M3","v":0},{"$f":"N3","v":0},null,null,null,null,1,"None","Ninguno","Aucun",0,0]
[null,{"$f":"INDEX(J4:L4,U_Calculation!$AD$2)","v":"Air gaps/ in ceilings 10 mm"},{"$f":"M4","v":0},{"$f":"N4","v":0.15},null,null,null,null,74,"Air gaps/ in ceilings 10 mm","Cámaras de Aire/Techos 10 mm","Lame d'air/Toiture 10 mm",null,0.15]
[null,{"$f":"INDEX(J5:L5,U_Calculation!$AD$2)","v":"Air gaps/ in ceilings 100 mm"},0,0.16,null,null,null,null,78,"Air gaps/ in ceilings 100 mm","Cámaras de Aire/Techos 100 mm","Lame d'air/Toiture 100 mm",null,0.16]
[null,{"$f":"INDEX(J6:L6,U_Calculation!$AD$2)","v":"Air gaps/ in ceilings 15 mm"},0,0.16,null,null,null,null,75,"Air gaps/ in ceilings 15 mm","Cámaras de Aire/Techos 15 mm","Lame d'air/Toiture 15 mm",null,0.16]
[null,{"$f":"INDEX(J7:L7,U_Calculation!$AD$2)","v":"Air gaps/ in ceilings 25 mm"},0,0.16,null,null,null,null,76,"Air gaps/ in ceilings 25 mm","Cámaras de Aire/Techos 25 mm","Lame d'air/Toiture 25 mm",null,0.16]
[null,{"$f":"INDEX(J8:L8,U_Calculation!$AD$2)","v":"Air gaps/ in ceilings 300 mm"},0,0.16,null,null,null,null,79,"Air gaps/ in ceilings 300 mm","Cámaras de Aire/Techos 300 mm","Lame d'air/Toiture 300 mm",null,0.16]
[null,{"$f":"INDEX(J9:L9,U_Calculation!$AD$2)","v":"Air gaps/ in ceilings 5 mm"},0,0.11,null,null,null,null,72,"Air gaps/ in ceilings 5 mm","Cámaras de Aire/Techos 5 mm","Lame d'air/Toiture 5 mm",null,0.11]
[null,{"$f":"INDEX(J10:L10,U_Calculation!$AD$2)","v":"Air gaps/ in ceilings 50 mm"},0,0.16,null,null,null,null,77,"Air gaps/ in ceilings 50 mm","Cámaras de Aire/Techos 50 mm","Lame d'air/Toiture 50 mm",null,0.16]
[null,{"$f":"INDEX(J11:L11,U_Calculation!$AD$2)","v":"Air gaps/ in ceilings 7 mm"},0,0.13,null,null,null,null,73,"Air gaps/ in ceilings 7 mm","Cámaras de Aire/Techos 7 mm","Lame d'air/Toiture 7 mm",null,0.13]
[null,{"$f":"INDEX(J12:L12,U_Calculation!$AD$2)","v":"Air gaps/ in floors 10 mm"},0,0.115,null,null,null,null,66,"Air gaps/ in floors 10 mm","Cámaras de Aire/Suelos 10 mm","Lame d'air/sols 10 mm",null,0.115]
[null,{"$f":"INDEX(J13:L13,U_Calculation!$AD$2)","v":"Air gaps/ in floors 100 mm"},0,0.22,null,null,null,null,70,"Air gaps/ in floors 100 mm","Cámaras de Aire/Suelos 100 mm","Lame d'air/sols 100 mm",null,0.22]
[null,{"$f":"INDEX(J14:L14,U_Calculation!$AD$2)","v":"Air gaps/ in floors 15 mm"},0,0.17,null,null,null,null,67,"Air gaps/ in floors 15 mm","Cámaras de Aire/Suelos 15 mm","Lame d'air/sols 15 mm",null,0.17]
[null,{"$f":"INDEX(J15:L15,U_Calculation!$AD$2)","v":"Air gaps/ in floors 25 mm"},0,0.19,null,null,null,null,68,"Air gaps/ in floors 25 mm","Cámaras de Aire/Suelos 25 mm","Lame d'air/sols 25 mm",null,0.19]
[null,{"$f":"INDEX(J16:L16,U_Calculation!$AD$2)","v":"Air gaps/ in floors 300 mm"},0,0.23,null,null,null,null,71,"Air gaps/ in floors 300 mm","Cámaras de Aire/Suelos 300 mm","Lame d'air/sols 300 mm",null,0.23]
[null,{"$f":"INDEX(J17:L17,U_Calculation!$AD$2)","v":"Air gaps/ in floors 5 mm"},0,0.11,null,null,null,null,64,"Air gaps/ in floors 5 mm","Cámaras de Aire/Suelos 5 mm","Lame d'air/sols 5 mm",null,0.11]
[null,{"$f":"INDEX(J18:L18,U_Calculation!$AD$2)","v":"Air gaps/ in floors 50 mm"},0,0.21,null,null,null,null,69,"Air gaps/ in floors 50 mm","Cámaras de Aire/Suelos 50 mm","Lame d'air/sols 50 mm",null,0.21]
[null,{"$f":"INDEX(J19:L19,U_Calculation!$AD$2)","v":"Air gaps/ in floors 7 mm"},0,0.13,null,null,null,null,65,"Air gaps/ in floors 7 mm","Cámaras de Aire/Suelos 7 mm","Lame d'air/sols 7 mm",null,0.13]
[null,{"$f":"INDEX(J20:L20,U_Calculation!$AD$2)","v":"Air gaps/ in walls 10 mm"},0,0.15,null,null,null,null,58,"Air gaps/ in walls 10 mm","Cámaras de Aire/Paredes 10 mm","Lame d'air/Façades 10 mm",null,0.15]
[null,{"$f":"INDEX(J21:L21,U_Calculation!$AD$2)","v":"Air gaps/ in walls 100 mm"},0,0.18,null,null,null,null,62,"Air gaps/ in walls 100 mm","Cámaras de Aire/Paredes 100 mm","Lame d'air/Façades 100 mm",null,0.18]
[null,{"$f":"INDEX(J22:L22,U_Calculation!$AD$2)","v":"Air gaps/ in walls 15 mm"},0,0.17,null,null,null,null,59,"Air gaps/ in walls 15 mm","Cámaras de Aire/Paredes 15 mm","Lame d'air/Façades 15 mm",null,0.17]
[null,{"$f":"INDEX(J23:L23,U_Calculation!$AD$2)","v":"Air gaps/ in walls 25 mm"},0,0.18,null,null,null,null,60,"Air gaps/ in walls 25 mm","Cámaras de Aire/Paredes 25 mm","Lame d'air/Façades 25 mm",null,0.18]
[null,{"$f":"INDEX(J24:L24,U_Calculation!$AD$2)","v":"Air gaps/ in walls 300 mm"},0,0.18,null,null,null,null,63,"Air gaps/ in walls 300 mm","Cámaras de Aire/Paredes 300 mm","Lame d'air/Façades 300 mm",null,0.18]
[null,{"$f":"INDEX(J25:L25,U_Calculation!$AD$2)","v":"Air gaps/ in walls 5 mm"},0,0.11,null,null,null,null,56,"Air gaps/ in walls 5 mm","Cámaras de Aire/Paredes 5 mm","Lame d'air/Façades 5 mm",null,0.11]
[null,{"$f":"INDEX(J26:L26,U_Calculation!$AD$2)","v":"Air gaps/ in walls 50 mm"},0,0.18,null,null,null,null,61,"Air gaps/ in walls 50 mm","Cámaras de Aire/Paredes 50 mm","Lame d'air/Façades 50 mm",null,0.18]
[null,{"$f":"INDEX(J27:L27,U_Calculation!$AD$2)","v":"Air gaps/ in walls 7 mm"},0,0.13,null,null,null,null,57,"Air gaps/ in walls 7 mm","Cámaras de Aire/Paredes 7 mm","Lame d'air/Façades 7 mm",null,0.13]
[null,{"$f":"INDEX(J28:L28,U_Calculation!$AD$2)","v":"Alveolar flagstone/ -high 200 mm"},0,0.13999999999999987,null,null,null,null,240,"Alveolar flagstone/ -high 200 mm","Losas Alveolares/Sin capa de compresión -Canto 200 mm","Dalles alvéolées/sans couche de compression -Epaisseur 200 mm",null,0.13999999999999987]
[null,{"$f":"INDEX(J29:L29,U_Calculation!$AD$2)","v":"Alveolar flagstone/ -high 250 mm"},0,0.16,null,null,null,null,241,"Alveolar flagstone/ -high 250 mm","Losas Alveolares/Sin capa de compresión -Canto 250 mm","Dalles alvéolées/sans couche de compression -Epaisseur 250 mm",null,0.16]
[null,{"$f":"INDEX(J30:L30,U_Calculation!$AD$2)","v":"Alveolar flagstone/ -high 300 mm"},0,0.19000000000000031,null,null,null,null,242,"Alveolar flagstone/ -high 300 mm","Losas Alveolares/Sin capa de compresión -Canto 300 mm","Dalles alvéolées/sans couche de compression -Epaisseur 300 mm",null,0.19000000000000031]
{"$rows_left_out":321}
{"sheet":"Instrucciones","index":2,"n_rows":100,"n_cols":1,"rows_kept":100,"cut":false,"hidden":false,"merged":[[99,0,99,15],[77,0,77,15],[49,0,49,15],[20,0,20,15],[0,0,0,15]]}
["1.- Modelización"]
[]
[]
[]
[]
[]
[]
[]
[]
[]
[]
[]
[]
[]
[]
[]
[]
[]
[]
[]
["2.- Introducción de datos"]
[]
[]
[]
[]
[]
[]
[]
[]
[]
{"$rows_left_out":71}
{"sheet":"Instructions","index":3,"n_rows":98,"n_cols":1,"rows_kept":98,"cut":false,"hidden":false,"merged":[[0,0,0,15],[20,0,20,15],[49,0,49,15],[72,0,72,15],[97,0,97,15]]}
["1.- Modelling"]
[]
[]
[]
[]
[]
[]
[]
[]
[]
[]
[]
[]
[]
[]
[]
[]
[]
[]
[]
["2.-Data introduction"]
[]
[]
[]
[]
[]
[]
[]
[]
[]
{"$rows_left_out":69}
{"sheet":"Traduc","index":4,"n_rows":31,"n_cols":7,"rows_kept":31,"cut":false,"hidden":true,"merged":[]}
[]
[null,"Selection",null,null,"English","Español","FRANÇAIS"]
[1,{"$f":"VLOOKUP(A3,$D$3:$G$31,U_Calculation!$AD$2+1,0)","v":"Thermal Transmittance calculation opaque walls"},null,1,"Thermal Transmittance calculation opaque walls","Cálculo de la Transmitancia térmica  de cerramientos opacos","Calcul transmittance thermique parois opaques"]
[2,{"$f":"VLOOKUP(A4,$D$3:$G$31,U_Calculation!$AD$2+1,0)","v":"Construction shall be divided in layers (perpendicular to heat flow) and Sections (parallel to heat flow)"},null,2,"Construction shall be divided in layers (perpendicular to heat flow) and Sections (parallel to heat flow)","La construcción debe dividirse en capas (perpendiculares al flujo de calor)  y secciones (paralelas al flujo de calor) ","L'élément doit être divisé en couches (perpendiculaires au flux de chaleur) et sections (parallèles au fluxe de chaleur)"]
[3,{"$f":"VLOOKUP(A5,$D$3:$G$31,U_Calculation!$AD$2+1,0)","v":"Type of wall"},null,3,"Type of wall","Tipo cerramiento","Type de paroi"]
[4,{"$f":"VLOOKUP(A6,$D$3:$G$31,U_Calculation!$AD$2+1,0)","v":"Total Length (m)"},null,4,"Total Length (m)","Ancho Total (m)","Largeur totale (m)"]
[5,{"$f":"VLOOKUP(A7,$D$3:$G$31,U_Calculation!$AD$2+1,0)","v":"Section a"},null,5,"Section a","Sección a","Section a"]
[6,{"$f":"VLOOKUP(A8,$D$3:$G$31,U_Calculation!$AD$2+1,0)","v":"Section b"},null,6,"Section b","Sección b","Section b"]
[7,{"$f":"VLOOKUP(A9,$D$3:$G$31,U_Calculation!$AD$2+1,0)","v":"Section c"},null,7,"Section c","Sección c","Section c"]
[8,{"$f":"VLOOKUP(A10,$D$3:$G$31,U_Calculation!$AD$2+1,0)","v":"Section d"},null,8,"Section d","Sección d","Section d"]
[9,{"$f":"VLOOKUP(A11,$D$3:$G$31,U_Calculation!$AD$2+1,0)","v":"Section f"},null,9,"Section f","Sección f","Section f"]
[10,{"$f":"VLOOKUP(A12,$D$3:$G$31,U_Calculation!$AD$2+1,0)","v":"Section g"},null,10,"Section g","Sección g","Section g"]
[11,{"$f":"VLOOKUP(A13,$D$3:$G$31,U_Calculation!$AD$2+1,0)","v":"Length (m)"},null,11,"Length (m)","ancho (m)","Largeur (m)"]
[12,{"$f":"VLOOKUP(A14,$D$3:$G$31,U_Calculation!$AD$2+1,0)","v":"Layers"},null,12,"Layers","Capas","Couches"]
[13,{"$f":"VLOOKUP(A15,$D$3:$G$31,U_Calculation!$AD$2+1,0)","v":"Thickness (m)"},null,13,"Thickness (m)","Espesor (m)","Epaisseur (m)"]
[14,{"$f":"VLOOKUP(A16,$D$3:$G$31,U_Calculation!$AD$2+1,0)","v":"Product"},null,14,"Product","Material","Matériel"]
[15,{"$f":"VLOOKUP(A17,$D$3:$G$31,U_Calculation!$AD$2+1,0)","v":"Thermal Transmittance without corrections"},null,15,"Thermal Transmittance without corrections","Transmitancia térmica sin correcciones","Transmittance thermique sans considération des corrections"]
[16,{"$f":"VLOOKUP(A18,$D$3:$G$31,U_Calculation!$AD$2+1,0)","v":"Thermal Transmittance with corrections"},null,16,"Thermal Transmittance with corrections","Transmitancia térmica con correcciones","Transmittance thermique avec considération des corrections"]
[17,{"$f":"VLOOKUP(A19,$D$3:$G$31,U_Calculation!$AD$2+1,0)","v":"AIR GAPS CORRECTION"},null,17,"AIR GAPS CORRECTION","CORRECCION POR AISLANTE EN CONTACTO CON CAMARA DE AIRE","CORRECTION DUE AUX LAMES D'AIR"]
[18,{"$f":"VLOOKUP(A20,$D$3:$G$31,U_Calculation!$AD$2+1,0)","v":"Level"},null,18,"Level","Nivel","Niveau"]
[19,{"$f":"VLOOKUP(A21,$D$3:$G$31,U_Calculation!$AD$2+1,0)","v":"Layer Nº next to air gap"},null,19,"Layer Nº next to air gap","Nº Capa adyacente a la cámara de aire","Nº de Couche adjacente a la lame d'air"]
[20,{"$f":"VLOOKUP(A22,$D$3:$G$31,U_Calculation!$AD$2+1,0)","v":"FASTENERS CORRECTION"},null,20,"FASTENERS CORRECTION","CORRECCION POR FIJACIONES","CORRECTION DUE AUX FIXATIONS"]
[21,{"$f":"VLOOKUP(A23,$D$3:$G$31,U_Calculation!$AD$2+1,0)","v":"Fasteners density (un/m2)"},null,21,"Fasteners density (un/m2)","Numero de fijaciones por m2","Numéro de fixations au m2"]
[22,{"$f":"VLOOKUP(A24,$D$3:$G$31,U_Calculation!$AD$2+1,0)","v":"Fasteners thermal conductivity (W/mK)"},null,22,"Fasteners thermal conductivity (W/mK)","Conductividad térmica de la fijación W/mK","Conductivité thermique de la fixation (W/mK)"]
[23,{"$f":"VLOOKUP(A25,$D$3:$G$31,U_Calculation!$AD$2+1,0)","v":"Areca of fastener (m2)"},null,23,"Areca of fastener (m2)","Sección de la fijación (m2)","Section de la fixation (m2)"]
[24,{"$f":"VLOOKUP(A26,$D$3:$G$31,U_Calculation!$AD$2+1,0)","v":"Insulation Thickness d0 (m)"},null,24,"Insulation Thickness d0 (m)","Espesor aislante (do) (m)","Epaisseur de l'isolant d0 (m)"]
[25,{"$f":"VLOOKUP(A27,$D$3:$G$31,U_Calculation!$AD$2+1,0)","v":"Fastener penetration thickness d1 (m)"},null,25,"Fastener penetration thickness d1 (m)","Espesor penetración fijación (d1) (m)","Epaisseur de la pénétration de la fixation (m)"]
[26,{"$f":"VLOOKUP(A28,$D$3:$G$31,U_Calculation!$AD$2+1,0)","v":"Layer nº peented by fastener"},null,26,"Layer nº peented by fastener","Nº de la capa afectadas por la fijación","Nº de la couche pénétré par l'isolant"]
[27,{"$f":"VLOOKUP(A29,$D$3:$G$31,U_Calculation!$AD$2+1,0)","v":"INVERTED ROOF CORRECTION"},null,27,"INVERTED ROOF CORRECTION","CORRECCION POR CUBIERTA INVERTIDA","CORRECTION POUR TOITURE INVERSÉE"]
[28,{"$f":"VLOOKUP(A30,$D$3:$G$31,U_Calculation!$AD$2+1,0)","v":"Average rain precipitation (mm/day)"},null,28,"Average rain precipitation (mm/day)","Precipitación media de lluvia (mm/día)","Précipitation pluie moyenne (mm/jour)"]
{"$rows_left_out":1}